آتلانتیک
scope note: سابقا در اروپا برای یک فاصله زمانی بین یخچالی بکار میرفته است که ادامه یخچال شمالی و پیش از یخچال فرعی شمالی بوده است. این زمان با قسمت اعظم فراز دمایی و بخش میانی دوره گرم بعد یخچالی منطبق است.
broader: هولوسن
preferred label: Atlantic @en
type: Concept

هولوسن
preferred label: Holocene @en
type: Concept
narrower: آتلانتیک