زغال‌سنگ
preferred label: coal @en
type: Concept
narrower: زغال‌سنگ تولید بخار

زغال‌سنگ تولید بخار
scope note: زغال‌سنگی که برای تولید بخار آب مناسب است.
broader: زغال‌سنگ
preferred label: steam coal @en
type: Concept