سخت‌رویه نمکی
scope note: لایه سخت و نازکی از دانه‌های ماسه سیمانی‌شده با نمک که در سواحل دریا دیده می‌شود
broader: سنگ رسوبی
preferred label: salcrete @en
type: Concept

سنگ رسوبی
preferred label: sedimentary rock @en
type: Concept
narrower: سخت‌رویه نمکی