سنگ آواری
preferred label: clastic rock @en
type: Concept
narrower: رادیولاریت

رادیولاریت
scope note: از رادیولرها، رنگی، معمولاً در اثر اکسیدهای آهن به رنگ قرمز و یا قرمز بنفش، بصورت تخته سنگهای منظم 5 تا 15 سانتیمتری که در لابلای آنها خاکهای رسی قرمز است
broader: سنگ آواری
preferred label: radiolarite @en
type: Concept