توده نفوذی
preferred label: intrusive mass @en
type: Concept
related: نفوذی

نفوذ
preferred label: intrusion @en
type: Concept
related: نفوذی

نفوذی
scope note: مربوط به فرایند نفوذ ویژگی سنگ‌های حاصل از نفوذ
related: توده نفوذی
related: نفوذ
preferred label: intrusive @en
type: Concept