کنگلومرای آتشفشانی
scope note: کنگلومرای تشکیل‏شده از قطعات آتشفشانی گردشده
broader: کنگلومرا
preferred label: volcanic conglomerate @en
type: Concept

کنگلومرا
preferred label: conglomerate @en
type: Concept
narrower: کنگلومرای آتشفشانی