سنگ آواری
preferred label: clastic rock @en
type: Concept
narrower: کنگلومرای مخروط افکنه‌ای

مواد خشکی
preferred label: terrigenous materials @en
type: Concept
related: کنگلومرای مخروط افکنه‌ای

کنگلومرای مخروط افکنه‌ای
scope note: نوعی کنگلومرا که در ابتدای نهشته های دلتای آبرفتی قرار گرفته است.
related: مواد خشکی
broader: سنگ آواری
preferred label: fanglomerate @en
type: Concept