گلسنگ
preferred label: mudstone @en
type: Concept
narrower: گِل‌سنگ ریگ‌دار

گِل‌سنگ ریگ‌دار
scope note: گِل‌سنگ کنگلومرایی که در آن ریگ‌های پراکنده در میان صفحه‌های لایه‌بندی قرار گرفته‌اند
broader: گلسنگ
preferred label: pebbly mudstone @en
type: Concept