سنگ آواری
preferred label: clastic rock @en
type: Concept
narrower: نواکولیت

نواکولیت
alternative label: تیغ سنگ
scope note: شیل های سخت سیلیسی که از دانه های بسیار ریز که اغلب با گروناهای ریز مبادله شده تشکیل یافته است در سری شیست های پالئوزوئیک(دوران) آردن در فرانسه و بلژیک دیده می شود و بعنوان سنگ تیزی مورد استفاده واقع می شود.
related: سنگ رسوبی شیمیایی
broader: سنگ آواری
preferred label: novaculite @en
type: Concept

سنگ رسوبی شیمیایی
preferred label: chemically precipitated rock @en
type: Concept
related: نواکولیت