جاسپیلیت
scope note: از انواع ژاسپ‌ها که دارای نوارهای آهن و منیزیم می‌باشد.
related: سازند آهن
broader: سنگ رسوبی شیمیایی
preferred label: jaspilite @en
type: Concept

سازند آهن
preferred label: Iron Formation @en
type: Concept
related: جاسپیلیت

سنگ رسوبی شیمیایی
preferred label: chemically precipitated rock @en
type: Concept
narrower: جاسپیلیت