دولومیت‌سنگ
preferred label: dolostone @en
type: Concept
narrower: دولومیت راه‌راه

دولومیت راه‌راه
scope note: سنگی دولومیتی، با نوارهای مشخص متشکل از لایه‌های خاکستری روشن درشت‌بافت و لایه‌های تیره‌تر ریزبافت
broader: دولومیت‌سنگ
preferred label: zebra dolomite @en
type: Concept