سنگ کربناتی
preferred label: carbonate rock @en
type: Concept
narrower: سنگ‌آوار

سنگ‌آوار
scope note: قطعه‌ای سنگ کربناتی با قطر بیش از دو میلی‌متر که از یک سنگ آهک یا دولومیت قدیمی‌تر به‌صورت مکانیکی جدا شده و در درون یا مجاور یا بیرون محل رسوب‌گذاری نهشته شده باشد
broader: سنگ کربناتی
preferred label: lithoclast @en
type: Concept