سنگ آذرین دگرگون‌شده
preferred label: metaigneous rock @en
type: Concept
narrower: سرپنتینیت

سرپنتینیت
alternative label: سنگ سرپنتین
scope note: واژه ترکیبی. سنگی است که در نتیجه آلتراسیون و دگرسانی و یا متامورفیسم سنگهای ماگمائی بازیک و اولترا بازیک بوجود می‌آید. این سنگ عموماً و یا تقریباً از کریزولیت و آنتی کوریت تشکیل میشود
related: سرپنتینی شدن
broader: سنگ آذرین دگرگون‌شده
preferred label: serpentinite @en
type: Concept

سرپنتینی شدن
preferred label: serpentinization @en
type: Concept
related: سرپنتینیت