سنگ دگرگونی همبری
scope note: سنگی که براثر فرایندهای دگرگونی همبری تشکیل می‌شود
broader: سنگ دگرگونی
preferred label: contact metamorphic rock @en
type: Concept

سنگ دگرگونی
preferred label: metamorphic rock @en
type: Concept
narrower: سنگ دگرگونی همبری