شیست
preferred label: schist @en
type: Concept
narrower: شیست آبی

گلوکوفان شیست
preferred label: glaucophane schist @en
type: Concept
related: شیست آبی

شیست آبی
scope note: در فشارهای زیادتر شیست های گلوکوفان- لازونیت پدید می آید.
related: گلوکوفان شیست
broader: شیست
preferred label: blueschist @en
type: Concept