آذرآواری
preferred label: pyroclastic @en
type: Concept
narrower: آذرآوار تصادفی

آذرآوار تصادفی
scope note: آذرآواری متشکل از قطعات غیرآتشفشانی یا آتشفشانی نامرتبط
broader: آذرآواری
preferred label: accidental pyroclast @en
type: Concept