بازالت قلیایی
preferred label: alkali basalt @en
type: Concept
narrower: تراکی دولریت

بازالت تراکیتی
preferred label: trachybasalt @en
type: Concept
related: تراکی دولریت

تراکی دولریت
scope note: نماینده دو گروه سنگهای تراکیتی و دولریتی (میکروگابروئی) که خصوصیات هر دو گروه را دارد
related: بازالت تراکیتی
broader: بازالت قلیایی
preferred label: trachydolerite @en
type: Concept