پورفیری
preferred label: porphyry @en
type: Concept
related: پورفیری کوارتزی

پورفیری کوارتزی
scope note: بافت پورفیری کوارتزدار که اغلب در سنگهای گرانیتی دیده می شود
related: پورفیری
broader: ریولیت
preferred label: quartz porphyry @en
type: Concept

ریولیت
preferred label: rhyolite @en
type: Concept
narrower: پورفیری کوارتزی