سنگ آب‌آواری
scope note: سنگی آتشفشانی که در هنگام سرد شدن در زیر آب یا یخ خرد شده است
broader: سنگ آتشفشانی
preferred label: hydroclastic rock @en
type: Concept

سنگ آتشفشانی
preferred label: volcanic rock @en
type: Concept
narrower: سنگ آب‌آواری