دیوریت کوارتزی
preferred label: quartz diorite @en
type: Concept
related: تونالیت

تونالیت
scope note: دیوریت کوارتزدار. نوعی سنگ دیوریت کوارتزدار که دارای بیش از 10 درصد کوارتز و پلاژیوکلاز است.
related: دیوریت کوارتزی
broader: دیوریت
preferred label: tonalite @en
type: Concept

دیوریت
preferred label: diorite @en
type: Concept
narrower: تونالیت