هورنبلندیت
scope note: از سنگ‌های تمام بلوری، دان‌دان که اساساً از هورنبلند تشکیل شده‌اند. یکی از تیپ‌های استثنایی آمفیبولیت می‌باشد. در پریدوتیت‌ها و گابروها تجمع یافته است. و یا به حالت‌های خاص در سنگ‌های دگرگونی یافت می‌شود و همانند آمفیبولیت‌هاست.
broader: فوق مافیک
preferred label: hornblendite @en
type: Concept

فوق مافیک
preferred label: ultramafic @en
type: Concept
narrower: هورنبلندیت