گابرو
preferred label: gabbro @en
type: Concept
narrower: رودینژیت

رودینژیت
scope note: از سنگهای ماگمائی تیپ گابروئی که در اثر پدیده دگرگونی متاسوماتیک تغییر شکل یافته بوجود می‌آیند. با پاراژنزهای گروناگروسولردار، پیروکسن، پرهنیت و سرپنتین همراه است
broader: گابرو
preferred label: rodingite @en
type: Concept