لامپروئیت
scope note: از سنگ‌های ماگمائی دانه‌ریز رگه‌دار که با میکای سیاه فراوان، آمفیبول خرمایی بلورریز و درشت همراه است.
broader: لامپروفیر
preferred label: lamproite @en
type: Concept

لامپروفیر
preferred label: lamprophyre @en
type: Concept
narrower: لامپروئیت