گلفین
preferred label: Gulfian @en
type: Concept
related: سازند سان میگل

تگزاس
preferred label: Texas @en
type: Concept
related: سازند سان میگل

سازند سان میگل
scope note: گلفین جنوب تگزاس. در محلهای دیگری نیز واقع است
related: گلفین
related: تگزاس
preferred label: San Miguel Formation @en
type: Concept