سازاهای آلی زغال‌سنگ
preferred label: maceral @en
type: Concept
narrower: زغال‌سنگ جلبکی

زغال‌سنگ جلبکی
scope note: زغال‏سنگی که به‌طور عمده از مواد جلبکی تشکیل شده است
broader: سازاهای آلی زغال‌سنگ
preferred label: alginite @en
type: Concept