برگ‌لایگی
preferred label: lamination @en
type: Concept
narrower: برگ‌لایگی درهم‌پیچیده

برگ‌لایگی درهم‌پیچیده
scope note: ساختاری رسوبی شامل مجموعه‌ای از چین‌های ایستاده یا برگشته که شدتشان هم به سمت بالا و هم به سمت پایین در یک لایۀ خاص کاهش می‌یابد
broader: برگ‌لایگی
preferred label: convolute lamination @en
type: Concept