سال‌چینه
preferred label: varve @en
type: Concept
narrower: سال‏چینه یخساری

سال‏چینه یخساری
scope note: لایه‏های ریز رسوبی که در هر سال توسط یخسار نهشته می‏شود
broader: سال‌چینه
preferred label: glacial varve @en
type: Concept