لایه‌بندی
preferred label: bedding @en
type: Concept
related: لایه‌بندی فلاسر

لایه‌بندی فلاسر
scope note: نوعی لایه‌بندی که در آن عدسی‌های کمانی گِلی در ناوه‌هایی از موج‌نقش‌های موجود در ماسه قرار گرفته‌اند و به سمت بالا انحنا دارند
related: لایه‌بندی
broader: ساخت لایه‌بندی صفحه‌ای
preferred label: flaser bedding @en
type: Concept

ساخت لایه‌بندی صفحه‌ای
preferred label: planar bedding structure @en
type: Concept
narrower: لایه‌بندی فلاسر