ژرفزایش
scope note: فرآیند تکاملی که منجر به انحطاط و کاهش توانایی می شود.
related: سنگ رسوبی
preferred label: catagenesis @en
type: Concept

سنگ رسوبی
preferred label: sedimentary rock @en
type: Concept
related: ژرفزایش