زهکشی
preferred label: drainage @en
type: Concept
related: زهکشی اسیدی سنگ

زهکشی اسیدی سنگ
scope note: زهکشی اسیدی که از اکسایش طبیعی کانی‌های سولفیدی موجود در سنگ در مجاورت هوا یا آب به وجود می‌آید
related: زهکشی
preferred label: acid rock drainage (ARD) @en
type: Concept