ناحیه پیک
scope note: ناحیه جلگه‌ای در شمال مرکز انگلستان در جنوب انتهایی زنجیره پنین
related: دربی شایر انگلستان
related: پنین
preferred label: Peak District @en
type: Concept

دربی شایر انگلستان
preferred label: Derbyshire England @en
type: Concept
related: ناحیه پیک

پنین
preferred label: Pennines @en
type: Concept
related: ناحیه پیک