زمین‌شناسی
preferred label: geology @en
type: Concept
related: زمین‌شناسی چهرنگاشتی

زمین‌شناسی چهرنگاشتی
scope note: شاخه‌ای از زمین‌شناسی که به عارضه‌نگاری می‌پردازد
related: زمین‌شناسی
preferred label: physiographic geology @en
type: Concept