علم زمین‌ساخت
preferred label: tectonics @en
type: Concept
related: زمین‌ساخت رسوبی

زمین‌ساخت رسوبی
scope note: مطالعۀ علمی جنبه‌های زمین‌ساختی لایه‌های رسوبی یا حوضه‌های رسوبی
related: حوضه رسوبی
related: علم زمین‌ساخت
preferred label: sedimentary tectonics @en
type: Concept

حوضه رسوبی
preferred label: sedimentary basin @en
type: Concept
related: زمین‌ساخت رسوبی