زمین
preferred label: Earth @en
type: Concept
related: زمین‏دماسنجی

زمین‏دماسنج
preferred label: geothermometer @en
type: Concept
related: زمین‏دماسنجی

زمین‏دماسنجی
scope note: اندازه‏گیری مستقیم یا غیرمستقیم یا برآورد دماهایی که فرایندهای زمین‏شناختی در آن دماها رخ داده یا رخ می‏دهد
related: زمین‏دماسنج
related: زمین
preferred label: geothermometry @en
type: Concept