زمین‏درز
scope note: خطی که مرز میان دو قطعه پوسته را که زمانی از هم جدا بوده‏اند و اکنون به‏ هم پیوسته‏اند نشان می‌دهد
related: ریخت‌شناسی
preferred label: suture (geosuture) @en
type: Concept

ریخت‌شناسی
preferred label: morphology @en
type: Concept
related: زمین‏درز