ریزساختار
scope note: سیماهای ساختاری سنگ‌ها که تنها با ریزبین قابل تشخیص باشد
related: ساختار
preferred label: microstructure @en
type: Concept

ساختار
preferred label: structure @en
type: Concept
related: ریزساختار