آریزونا
preferred label: Arizona @en
type: Concept
related: رودخانه سالت

رودخانه سالت
scope note: از مشرق آریزونا آغاز و در جهت غرب به رود گیلا در غرب فوئنیکس می‌ریزد
related: دره رود سالت
related: آریزونا
preferred label: Salt River @en
type: Concept

دره رود سالت
preferred label: Salt River Valley @en
type: Concept
related: رودخانه سالت