رود
preferred label: stream @en
type: Concept
narrower: رود شیبی

رود شیبی
scope note: رودی که در راستای شیب لایه‏های بستر خود جریان داشته باشد
broader: رود
preferred label: dip stream @en
type: Concept