ناحیه دکلب جورجیا
preferred label: De Kalb County Georgia @en
type: Concept
related: رشته‌کوه استون

رشته‌کوه استون
scope note: تپه سنگ گرانیتی خاکستری هیوگ در ناحیه دکالب نزدیک آتلانتا، ضمناً در محلهای دیگر نیز واقع شده است.
related: ناحیه دکلب جورجیا
preferred label: Stone Mountain @en
type: Concept