سبزماسه
scope note: رسوب سخت‌نشدۀ دریایی متشکل از ذرات گلوکونیت سبز تیره همراه با مخلوطی از رس و ماسه
broader: رسوب دریایی
preferred label: green sand @en
type: Concept

رسوب دریایی
preferred label: marine sediment @en
type: Concept
narrower: سبزماسه