لجن آهکی
scope note: رسوب ژرف‌دریایی دریامیانی با دستِ‌کم 30 درصد بازماندۀ اسکلتی آهکی
broader: رسوب دریایی
preferred label: calcareous ooze @en
type: Concept

رسوب دریایی
preferred label: marine sediment @en
type: Concept
narrower: لجن آهکی