رده بلوری
preferred label: crystal class @en
type: Concept
narrower: رده دودوازده‌وجهی

رده دودوازده‌وجهی
scope note: رده بلوری در سامانه مکعبی با تقارن -3 2/0m
broader: رده بلوری
preferred label: diploidal class @en
type: Concept