رده بلوری
preferred label: crystal class @en
type: Concept
narrower: رده دوشش‌گوش‌ ـ دوهرمی

رده دوشش‌گوش‌ ـ دوهرمی
scope note: رده بلوری در سامانه شش‌گوش با تقارن 6/0m 2/0m 2/0m
broader: رده بلوری
preferred label: dihexagonal-dipyramidal class @en
type: Concept