رده لوزی‌ ـ دوگوه‌ای
scope note: رده بلوری در سامانه راست‌لوزی با تقارن 2 2 2
broader: رده بلوری
preferred label: rhombic-disphenoidal class @en
type: Concept

رده بلوری
preferred label: crystal class @en
type: Concept
narrower: رده لوزی‌ ـ دوگوه‌ای