رخساره
preferred label: facies @en
type: Concept
related: رخساره کانیایی

رخساره کانیایی
scope note: سنگ‌هایی با منشأهای مختلف که اجزای آنها در محدوده‌های خاصی از فشار و حرارت تشکیل می‌شوند
related: رخساره
preferred label: mineral facies @en
type: Concept