رخساره سنگ‌نگاشتی
scope note: رخساره‌ای که ازطریق ترکیب و ظاهر سنگ قابل تشخیص است
related: رخساره
preferred label: petrographic facies @en
type: Concept

رخساره
preferred label: facies @en
type: Concept
related: رخساره سنگ‌نگاشتی