رخ کنگره‌ای
scope note: رخی ناشی از سوگیری ترجیحی لایه‌های سنگ یا دانه‌های کانی که براثر چین‌خوردگی ریزمقیاس به ‌وجود می‌آید
broader: رخ
preferred label: crenulation cleavage @en
type: Concept

رخ
preferred label: cleavage @en
type: Concept
narrower: رخ کنگره‌ای