ذوزنقه‌وجهی
preferred label: trapezohedron @en
type: Concept
narrower: ذوزنقه‌وجهی شش‌گوش

ذوزنقه‌وجهی شش‌گوش
alternative label: ذوزنقه‌وجهی شش‌گوشه‌ای
scope note: دیسۀ بلوری دوازده‌وجهی با یک محور شش‌تایه و سه محور دوتایه که فاقد صفحۀ آینه‌ای و مرکز تقارن است
broader: ذوزنقه‌وجهی
preferred label: hexagonal trapezohedron @en
type: Concept