ذوب ضربه‌ای
scope note: ذوب مواد در دمای بالای حاصل از امواج ضربه‌ای پرفشار
related: ذوب جزء‌به‌جزء
related: ذوب بخشی
preferred label: shock melting @en
type: Concept

ذوب جزء‌به‌جزء
preferred label: fractional melting @en
type: Concept
related: ذوب ضربه‌ای

ذوب بخشی
preferred label: partial melting @en
type: Concept
related: ذوب ضربه‌ای