جی.اس.آ
preferred label: GSA @en
type: Concept
related: دهه زمین‌شناسی آمریکای شمالی

آمریکای شمالی
preferred label: North America @en
type: Concept
related: دهه زمین‌شناسی آمریکای شمالی

دهه زمین‌شناسی آمریکای شمالی
scope note: مخفف. سری طرح‌هایی که مورد تعهد سازمان زمین شناسی آمریکا می‌باشد.
related: جی.اس.آ
related: آمریکای شمالی
preferred label: DNAG @en
type: Concept